{"text_format":"1","workbook":"xlsx","n_sheets":4,"sheets":["FAST Form","Tables","Translations","Revisions"],"not_rendered":{"charts":0,"images":14,"macros":1,"external_links":0,"defined_names":25,"comments":0,"pivot_tables":0},"unopened":[],"bounds":{"document_bytes":16777216,"sheet_cells":100000,"rows_first":2000,"rows_last":500,"rows_between":2000,"halvings":0,"cell_chars":16384,"cell_head_chars":4096},"cells_cut":0,"cells_raw":0,"read":"whole","date_system":"1900"}

{"sheet":"FAST Form","index":0,"n_rows":56,"n_cols":13,"rows_kept":56,"cut":false,"hidden":false,"merged":[[14,10,14,12],[49,1,49,6],[50,1,50,6],[7,5,7,6],[0,1,0,5],[10,2,10,3],[1,1,1,6],[10,5,10,6],[7,2,7,3],[8,2,8,3],[9,2,9,3],[8,5,8,6],[9,5,9,6],[33,4,33,5],[31,2,31,3],[41,1,41,6],[42,1,42,6],[14,2,14,3],[36,2,36,3],[36,5,36,6],[33,2,33,3],[34,2,34,3],[35,2,35,3],[32,2,32,3],[29,2,29,3],[23,4,23,6],[31,5,31,6],[48,1,48,6],[45,1,45,6],[46,1,46,6],[47,1,47,6],[43,1,43,6],[44,1,44,6]]}
[null,"PDM Flow Meters     "]
[null,"FAST (FLEXIBLE APPLICATION SUPPORT TOOL)"]
[]
[null,{"$f":"VLOOKUP(\"Date\",Master,Lang,FALSE)","v":"Число"},{"$f":"TODAY()","v":"2016-04-25"},null,null,"                           →      ","Russian"]
[]
[null,{"$f":"CONCATENATE(\" » \",VLOOKUP(\"Customer\",Master,Lang,FALSE))","v":" » Заказчик"}]
[]
[null,{"$f":"VLOOKUP(\"Company\",Master,Lang,FALSE)","v":"Компания"},null,null,{"$f":"VLOOKUP(\"Industry\",Master,Lang,FALSE)","v":"Отрасль"}]
[null,{"$f":"VLOOKUP(\"Contact\",Master,Lang,FALSE)","v":"Контактное лицо"},null,null,{"$f":"VLOOKUP(\"Position\",Master,Lang,FALSE)","v":"Должность"}]
[null,{"$f":"VLOOKUP(\"Email\",Master,Lang,FALSE)","v":"Email"},null,null,{"$f":"VLOOKUP(\"Telephone\",Master,Lang,FALSE)","v":"Телефон"}]
[null,{"$f":"VLOOKUP(\"Project\",Master,Lang,FALSE)","v":"Проект"},null,null,{"$f":"VLOOKUP(\"Final destination\",Master,Lang,FALSE)","v":"Страна назначен."}]
[]
[null,{"$f":"CONCATENATE(\" » \",VLOOKUP(\"Process\",Master,Lang,FALSE))","v":" » Процесс"}]
[]
[null,{"$f":"VLOOKUP(\"Fluid\",Master,Lang,FALSE)","v":"Среда"},null,null,null,null,null,null,null,null,"» Form Check"]
[]
[null,null,{"$f":"VLOOKUP(\"Minimum\",Master,Lang,FALSE)","v":"Минимум"},{"$f":"VLOOKUP(\"Operation\",Master,Lang,FALSE)","v":"Рабочий парам."},{"$f":"VLOOKUP(\"Maximum\",Master,Lang,FALSE)","v":"Максимум"},{"$f":"VLOOKUP(\"Design\",Master,Lang,FALSE)","v":"Исполнение"},{"$f":"VLOOKUP(\"Unit\",Master,Lang,FALSE)","v":"Мера"},null,null,null,{"$f":"VLOOKUP(\"Minimum\",Master,Lang,FALSE)","v":"Минимум"},{"$f":"VLOOKUP(\"Maximum\",Master,Lang,FALSE)","v":"Максимум"},"T > 150⁰C"]
[null,{"$f":"VLOOKUP(\"Flowrate\",Master,Lang,FALSE)","v":"Диапазон расходов"},null,null,null,null,"kg/h",null,null,null,{"$f":"IF(MIN(C18:E18)<>C18,\"Error\", \"OK\")","v":"OK"},{"$f":"IF(MAX(C18:E18)<>E18,\"Error\", \"OK\")","v":"OK"}]
[null,{"$f":"VLOOKUP(\"Density\",Master,Lang,FALSE)","v":"Плотность"},null,null,null,null,"kg/m³",null,null,null,{"$f":"IF(MIN(C19:E19)<>C19,\"Error\", \"OK\")","v":"OK"},{"$f":"IF(MAX(C19:E19)<>E19,\"Error\", \"OK\")","v":"OK"}]
[null,{"$f":"VLOOKUP(\"Viscosity\",Master,Lang,FALSE)","v":"Вязкость"},null,null,null,null,"Centipoise (cP)",null,null,null,{"$f":"IF(MIN(C20:E20)<>C20,\"Error\", \"OK\")","v":"OK"},{"$f":"IF(MAX(C20:E20)<>E20,\"Error\", \"OK\")","v":"OK"}]
[null,{"$f":"VLOOKUP(\"Pressure\",Master,Lang,FALSE)","v":"Давление"},null,null,null,null,"bar(g)",null,null,null,{"$f":"IF(MIN(C21:E21)<>C21,\"Error\", \"OK\")","v":"OK"},{"$f":"IF(MAX(C21:E21)<>E21,\"Error\", \"OK\")","v":"OK"}]
[null,{"$f":"VLOOKUP(\"Temperature\",Master,Lang,FALSE)","v":"Температура"},null,null,null,null,"⁰C",null,{"$f":"IF(M22=\"Error\",CONCATENATE(VLOOKUP(\"Temperature\",Master,Lang,FALSE), \" >  150⁰C  !!!\"), \"\")","v":""},null,{"$f":"IF(MIN(C22:E22)<>C22,\"Error\", \"OK\")","v":"OK"},{"$f":"IF(MAX(C22:E22)<>E22,\"Error\", \"OK\")","v":"OK"},{"$f":"IF(OR(AND(MAX(C22:F22)>302,G22=\"⁰F\"),AND(MAX(C22:F22)>150,G22=\"⁰C\"),AND(MAX(C22:F22)>423,G22=\"K\")),\"Warning\", \"OK\")","v":"OK"}]
[]
[null,{"$f":"VLOOKUP(\"Max. Allowed Pressure drop\",Master,Lang,FALSE)","v":"Макс. доп. перепад давления"},null,{"$f":"G21","v":"bar(g)"},{"$f":"IF(K24=\"Error\",CONCATENATE(VLOOKUP(\"Max. Allowed Pressure drop\",Master,Lang,FALSE), \" > \",VLOOKUP(\"Minimum\",Master,Lang,FALSE), \" !!!\"), \"\")","v":""},null,null,null,null,null,{"$f":"IF(C24>MIN(C21:F21), \"Error\",\"OK\")","v":"OK"}]
[]
[null,{"$f":"CONCATENATE(VLOOKUP(\"Expected Accuracy\",Master,Lang,FALSE), \" (\", VLOOKUP(\"Flowrate\",Master,Lang,FALSE),\")\")","v":"Доп. погрешность (масс. расход) (Диапазон расходов)"}]
[]
[null,{"$f":"CONCATENATE(\" » \",VLOOKUP(\"Meter\",Master,Lang,FALSE))","v":" » Расходомер"}]
[]
[null,"TAG"]
[]
[null,{"$f":"VLOOKUP(\"Process Connection\",Master,Lang,FALSE)","v":"Подключение к процессу"},null,null,{"$f":"VLOOKUP(\"Technology\",Master,Lang,FALSE)","v":"технологий"}]
[null,{"$f":"VLOOKUP(\"Power supply\",Master,Lang,FALSE)","v":"Питание"}]
[null,{"$f":"VLOOKUP(\"Indication\",Master,Lang,FALSE)","v":"Индикация"},null,null,{"$f":"VLOOKUP(\"Distance Meter-Display\",Master,Lang,FALSE)","v":"Расстояние расходомер<->дисплей"}]
[null,{"$f":"CONCATENATE(VLOOKUP(\"Area Classification\",Master,Lang,FALSE), \" (\",VLOOKUP(\"Meter\",Master,Lang,FALSE),\")\")","v":"Классификация зоны (Расходомер)"}]
[null,{"$f":"CONCATENATE(VLOOKUP(\"Area Classification\",Master,Lang,FALSE), \" (\",VLOOKUP(\"Display\",Master,Lang,FALSE),\")\")","v":"Классификация зоны (Дисплей)"}]
[null,{"$f":"VLOOKUP(\"Communication Protocol\",Master,Lang,FALSE)","v":"Интерфейс связи"}]
[]
[]
[null,{"$f":"CONCATENATE(\" » \",VLOOKUP(\"Comments\",Master,Lang,FALSE))","v":" » Комментарии"}]
[]
[]
[]
[]
[]
[]
[]
[]
[]
[]
[]
[]
[]
[]
[null,"Version: 2.2"]
[null,null,null,{"$f":"VLOOKUP(\"Reset\",Master,Lang,FALSE)","v":"Сброс"},"→ PDF",{"$f":"VLOOKUP(\"Print\",Master,Lang,FALSE)","v":"Печать"},{"$f":"VLOOKUP(\"Save\",Master,Lang,FALSE)","v":"Сохранить"}]

{"sheet":"Tables","index":1,"n_rows":230,"n_cols":19,"rows_kept":230,"cut":false,"hidden":true,"merged":[]}
["Tables"]
[]
["PROCESS CONNECTIONS",null,"COUNTRY",null,"INDUSTRY",null,"AREA",null,"Language",null,null,null,"Density",null,"Viscosity",null,"Flowrate",null,"Pressure"]
["→ ANSI B16.5 Flanges",null,"Afghanistan ",null,"Aviation & Aerospace",null,{"$f":"+VLOOKUP(\"Safe Area\",Master,Lang,FALSE)","v":"Безопасная зона"},null,"English",1,null,null,"S.G.",null,"Stoke (St)",null,"kg/s",null,"bar(a)"]
["0,5\" CL 150 ANSI",null,"Albania ",null,"Automotive",null,"ATEX Zone 1",null,"German",3,null,null,"kg/m³",null,"Centistoke (cSt)",null,"kg/m",null,"bar(g)"]
["0,5\" CL 300 ANSI",null,"Algeria ",null,"Temperature Circuit",null,"ATEX Zone 2",null,"Italian",6,null,null,"kg/L",null,"mPa*s",null,"kg/h",null,"kg/cm²(a)"]
["0,5\" CL 600 ANSI",null,"American Samoa ",null,"Chemical",null,"IEC Zone 1",null,"Portuguese",4,null,null,"g/cm³",null,"Centipoise (cP)",null,"kg/d",null,"kg/cm²(g)"]
["0,5\" CL 900 ANSI",null,"Andorra ",null,"Energy",null,"CSA Class I Div. 1",null,"Russian",5,null,null,"lb/in³",null,"Pa*s",null,"L/s",null,"psig"]
["1.0\" CL 150 ANSI",null,"Angola ",null,"Consumption Measurement",null,{"$f":"+VLOOKUP(\"Other (specify)\",Master,Lang,FALSE)","v":"Другие"},null,"Spanish",2,null,null,"lb/ft³",null,"kg/m/s",null,"L/m",null,"psia"]
["1.0\" CL 300 ANSI",null,"Anguilla ",null,"Hydraulic",null,null,null,"Chinese",7,null,null,"lb/gal",null,"N*s/m²",null,"L/h",null,"kPa"]
["1.0\" CL 600 ANSI",null,"Antigua & Barbuda ",null,"Fuel Consumption",null,null,null,"Polish",8,null,null,null,null,"dyn*s/cm²",null,"L/d",null,"MPa"]
["1.0\" CL 900 ANSI",null,"Argentina ",null,"Food&Beverage",null,null,null,"French",9,null,null,null,null,"m²/s",null,"cc/m",null,"atm"]
["1.5\" CL 150 ANSI",null,"Armenia ",null,"Marine",null,"INDICATION",null,"Korean",10,null,null,null,null,"L/cm/min",null,"gps"]
["1.5\" CL 300 ANSI",null,"Aruba ",null,"Paper",null,{"$f":"+VLOOKUP(\"Local\",Master,Lang,FALSE)","v":"Локальный"},null,null,null,null,null,"Temperature",null,"lb*s/in²",null,"gpm"]
["1.5\" CL 600 ANSI",null,"Australia ",null,"Oil & Gas",null,{"$f":"+VLOOKUP(\"Remote (Meter)\",Master,Lang,FALSE)","v":"Выносное исполнение (расходомер)"},null,{"$f":"VLOOKUP('FAST Form'!G4,Tables!I4:J13,2,FALSE)","v":5},null,null,null,"⁰C",null,"lb*s/ft²",null,"gph"]
["1.5\" CL 900 ANSI",null,"Austria ",null,"Pharmacy",null,{"$f":"+VLOOKUP(\"Remote (Panel)\",Master,Lang,FALSE)","v":"Выносное исполнение (панель)"},null,null,null,null,null,"⁰F",null,"lb/ft/hr",null,"gpd"]
["2\" CL 150 ANSI",null,"Azerbaijan ",null,"Plastic",null,{"$f":"+VLOOKUP(\"Other (specify)\",Master,Lang,FALSE)","v":"Другие"},null,null,null,null,null,"K",null,"ft²/min",null,"lb/s"]
["2\" CL 300 ANSI",null,"Bahamas, The ",null,"Renewable Energy",null,null,null,null,null,null,null,null,null,null,null,"lb/m"]
["2\" CL 600 ANSI",null,"Bahrain ",null,"Steel&Mining",null,null,null,null,null,null,null,null,null,null,null,"lb/h"]
["2\" CL 900 ANSI",null,"Bangladesh ",null,"Semiconductor",null,"POWER SUPPLY",null,null,null,null,null,null,null,null,null,"lb/d"]
["3\" CL 150 ANSI",null,"Barbados ",null,"Skid Manufacturer",null,"24 VDC",null,null,null,null,null,null,null,null,null,"m³/s"]
["3\" CL 300 ANSI",null,"Belarus ",null,"Water & Waste Water",null,"110 VAC",null,null,null,null,null,null,null,null,null,"m³/m"]
["3\" CL 600 ANSI",null,"Belgium ",null,null,null,"220 VAC",null,null,null,null,null,null,null,null,null,"m³/h"]
["3\" CL 900 ANSI",null,"Belize ",null,{"$f":"MATCH('FAST Form'!F8,Tables!E4:E22,FALSE)","v":{"$error":"#N/A"}},null,null,null,null,null,null,null,null,null,null,null,"ft³/s"]
["4\" CL 150 ANSI",null,"Benin ",null,null,null,null,null,null,null,null,null,null,null,null,null,"ft³/m"]
["4\" CL 300 ANSI",null,"Bermuda ",null,null,null,"PROTOCOL",null,null,null,null,null,null,null,null,null,"ft³/h"]
["4\" CL 600 ANSI",null,"Bhutan ",null,null,null,"MODBUS (RS485)",null,null,null,null,null,null,null,null,null,"Bbl/d"]
["4\" CL 900 ANSI",null,"Bolivia ",null,null,null,"MODBUS (RS485)+HART",null,null,null,null,null,null,null,null,null,"MBbl/d"]
["0.75\" CL 150 ANSI",null,"Bosnia & Herzegovina ",null,null,null,"MODBUS (RS485)+FF"]
["0.75\" CL 300 ANSI",null,"Botswana ",null,null,null,"MODBUS (RS485)+USB"]
["0.75\" CL 600 ANSI",null,"Brazil ",null,null,null,"HART"]
["0.75\" CL 900 ANSI",null,"British Virgin Is. ",null,null,null,"FOUNDATION FIELDBUS"]
["0,5\" CL 2500 ANSI",null,"Brunei ",null,null,null,{"$f":"+VLOOKUP(\"Other (specify)\",Master,Lang,FALSE)","v":"Другие"}]
["5\" CL 150 ANSI",null,"Bulgaria "]
["5\" CL 300 ANSI",null,"Burkina Faso "]
["5\" CL 600 ANSI",null,"Burma ",null,null,null,"Technology"]
["5\" CL 900 ANSI",null,"Burundi ",null,null,null,{"$f":"+VLOOKUP(\"Gear Flow Meter\",Master,Lang,FALSE)","v":"Передач расходомер"}]
["5\" CL 1500 ANSI",null,"Cambodia ",null,null,null,{"$f":"+VLOOKUP(\"Helical Flow Meter\",Master,Lang,FALSE)","v":"Винтовая расходомер"}]
["5\" CL 2500 ANSI",null,"Cameroon ",null,null,null,{"$f":"+VLOOKUP(\"Turbine Flow Meter\",Master,Lang,FALSE)","v":"Турбинный счетчик"}]
["6\" CL 150 ANSI",null,"Canada ",null,null,null,{"$f":"+VLOOKUP(\"Micro Flow Meter\",Master,Lang,FALSE)","v":"Микро расходомер"}]
["1\" CL 2500 ANSI",null,"Cape Verde ",null,null,null,{"$f":"+VLOOKUP(\"Other (specify)\",Master,Lang,FALSE)","v":"Другие"}]
["1.5\" CL 2500 ANSI",null,"Cayman Islands "]
["2\" CL 2500 ANSI",null,"Central African Rep. "]
["3\" CL 2500 ANSI",null,"Chad "]
["4\" CL 2500 ANSI",null,"Chile "]
["2.5\" CL 150 ANSI",null,"China "]
["→ DIN Flanges",null,"Colombia "]
["DN15 PN40 EN 1092-1 Form B1",null,"Comoros "]
["DN15 PN100 EN 1092-1 Form B1",null,"Congo, Dem. Rep. "]
["DN10 PN40 EN 1092-1 Form B1",null,"Congo, Repub. of the "]
["DN20 PN40 EN 1092-1 Form B1",null,"Cook Islands "]
["DN25 PN40 EN 1092-1 Form B1",null,"Costa Rica "]
["DN25 PN100 EN 1092-1 Form B1",null,"Cote d'Ivoire "]
["DN25 PN250 EN 1092-1 Form B1",null,"Croatia "]
["DN32 PN40 EN 1092-1 Form B1",null,"Cuba "]
["DN40 PN16 EN 1092-1 Form B1",null,"Cyprus "]
["DN40 PN40 EN 1092-1 Form B1",null,"Czech Republic "]
["DN40 PN100 EN 1092-1 Form B1",null,"Denmark "]
["DN50 PN40 EN 1092-1 Form B1",null,"Djibouti "]
["DN50 PN100 EN 1092-1 Form B1",null,"Dominica "]
["DN65 PN40 EN 1092-1 Form B1",null,"Dominican Republic "]
["DN80 PN40 EN 1092-1 Form B1",null,"East Timor "]
["DN80 PN100 EN 1092-1 Form B1",null,"Ecuador "]
["DN100 PN40 EN 1092-1 Form B1",null,"Egypt "]
["DN100 PN100 EN 1092-1 Form B1",null,"El Salvador "]
["DN125 PN40 EN 1092-1 Form B1",null,"Equatorial Guinea "]
["DN125 PN100 EN 1092-1 Form B1",null,"Eritrea "]
["→ Threaded connections",null,"Estonia "]
["G0.25\"",null,"Ethiopia "]
["G0.375\"",null,"Faroe Islands "]
["G0,5\" ",null,"Fiji "]
["G0.75\"",null,"Finland "]
["G1\"",null,"France "]
["G1.25\"",null,"French Guiana "]
["G1.5\"",null,"French Polynesia "]
["1.75\"",null,"Gabon "]
["2\"",null,"Gambia, The "]
["0.25\" NPT",null,"Gaza Strip "]
["0.5\" NPT",null,"Georgia "]
["0.75\" NPT",null,"Germany "]
["1\" NPT",null,"Ghana "]
["1.25\" NPT",null,"Gibraltar "]
["1.5\" NPT",null,"Greece "]
["1.75\" NPT",null,"Greenland "]
["2\" NPT",null,"Grenada "]
["→ Swagelok connections",null,"Guadeloupe "]
["1/8\" Swagelok welded",null,"Guam "]
["1/4\" Swagelok welded",null,"Guatemala "]
["3/8\" Swagelok welded",null,"Guernsey "]
["1/2\" Swagelok welded",null,"Guinea "]
["3/4\" Swagelok welded",null,"Guinea-Bissau "]
["1\" Swagelok welded",null,"Guyana "]
["1/8\" Swagelok VCR threaded ",null,"Haiti "]
["1/4\" Swagelok VCR threaded ",null,"Honduras "]
["3/8\" Swagelok VCR threaded ",null,"Hong Kong "]
["1/2\" Swagelok VCR threaded ",null,"Hungary "]
["3/4\" Swagelok VCR threaded ",null,"Iceland "]
["1\" Swagelok VCR threaded ",null,"India "]
["→ JIS Flanges",null,"Indonesia "]
["JIS 15mm 10K/20K",null,"Iran "]
["JIS 15mm 40K",null,"Iraq "]
["JIS 15mm 40K",null,"Ireland "]
["JIS 25mm 10K/20K",null,"Isle of Man "]
["JIS 25mm 40K",null,"Israel "]
["JIS 25mm 40K",null,"Italy "]
["JIS 40mm 10K",null,"Jamaica "]
["JIS 40mm 20K",null,"Japan "]
["JIS 50mm 10K",null,"Jersey "]
["JIS 50mm 20K",null,"Jordan "]
["JIS 50mm 40K",null,"Kazakhstan "]
["JIS 80mm 10K",null,"Kenya "]
["JIS 80mm 20K",null,"Kiribati "]
["JIS 100mm 10K",null,"Korea, North "]
["JIS 100mm 20K",null,"Korea, South "]
["→ DIN 11851",null,"Kuwait "]
["DN 15 DIN 11851",null,"Kyrgyzstan "]
["DN 25 DIN 11851",null,"Laos "]
["DN 40 DIN 11851",null,"Latvia "]
["DN 50 DIN 11851",null,"Lebanon "]
["DN 65 DIN 11851",null,"Lesotho "]
{"$rows_left_out":111}
{"sheet":"Translations","index":2,"n_rows":69,"n_cols":10,"rows_kept":69,"cut":false,"hidden":true,"merged":[]}
["Translations"]
[]
["English","Spanish","German","Portuguese","Russian","Italian","Chinese","Polish","French","Korean"]
["Date","Fecha","Datum","Data","Число","Data","日期","Data","Date","일자"]
["Company","Compañía","Unternehmen","Companhia","Компания","Azienda","公司","Firma","Société","회사"]
["Contact","Contacto","Ansprechpartner","Contato","Контактное лицо","Persona di contatto","联系人","Kontakt","Contact","연락처"]
["Project","Proyecto","Projekt","Projeto","Проект","Progetto","项目","Projekt","Projet","프로젝트"]
["Email","Email","Email","Email","Email","E-mail","电子邮件","Email","Courriel","이메일"]
["Position","Cargo","Anstellung","Posto","Должность","Posizione","位置","Pozycja","Position","지역"]
["Customer","Cliente","Kunde","Cliente","Заказчик","Cliente","客户","Klient","Client","고객 "]
["Country","Pais","Land","Pais","Страна","Paese","国家","Kraj","Pays","국가"]
["Telephone","Teléfono","Telefon","Telefone","Телефон","Telefono","电话","Telefon","Téléphone","전화번호"]
["Industry","Industria","Industrie","Industria","Отрасль","Settore","工业","Przemysł","Industrie","산업분야"]
["Final destination","Destino final","Bestimmungsort","Destino final","Страна назначен.","Destinazione finale","最终目的","Odbiorca końcowy","Destination finale","최종목적지"]
["Flowrate","Caudal","Durchfluss","Vazão","Диапазон расходов","Flusso","流量","Zakres przepływu","Débit","유량범위"]
["Pressure","Presión","Druck","Pressão","Давление","Pressione","压力","Ciśnienie","Pression","압력"]
["Temperature","Temperatura","Temperatur","Temperatura","Температура","Temperatura","温度","Temperatura","Température","온도"]
["Density","Densidad","Dichte","Densidade","Плотность","Densità","密度","Gestość","Densité","밀도"]
["Viscosity","Viscosidad","Viskosität","Viscosidade","Вязкость","Viscosità","粘度","Lepkość","Viscosité","점도"]
["Fluid","Fluido","Flüssigkeit","Fluido","Среда","Fluido","流体","Medium","Fluide","유체"]
["Minimum","Mínimo","Minimum","Mínimo","Минимум","Minimo","最小","Minimum","Minimum","최소유량"]
["Maximum","Máximo","Maximum","Máximo","Максимум","Massimo","最大","Maksimum","Maximum","최대유량"]
["Operation","Operación","Normal ","Operação","Рабочий парам.","Funzionamento","操作","Działanie","Service","운전유량"]
["Design","Diseño","Design","Desenho","Исполнение","Disegno","设计","Wykonanie","Design","설계유량"]
["Unit","Unidad","Einheit","Unidade","Мера","Unità","单位","Jednostka","Unité","단위"]
["Max. Allowed Pressure drop","Máxima Caída de presión","max. zul. Druckverlust","Queda de Pressão Max.","Макс. доп. перепад давления","Caduta di pressione massima ","最大允许压损","Dopuszczalny spadek ciśnienia","Perte de pression max. autorisée","최대 허용 압력손실"]
["Expected Accuracy","Exactitud esperada","Genauigkeit","Exatidão esperada","Доп. погрешность (масс. расход)","Grado di precisione previsto","期望精度","Oczekiwana dokładność","Précision attendue","요청 정밀도"]
["Process Connection","Conexión a proceso","Prozessanschluss","Conexão a processo","Подключение к процессу","Collegamento al processo","过程连接","Przyłącze","Connexion process","연결구"]
["Power Supply","Alimentación","Stromversorgung ","Alimentação","Питание","Alimentazione","电源","Zasilanie","Alimentation","공급전원"]
["Communication Protocol","Protocolo de comunicación","Kommunikationsprotokoll","Protocolo de comunicação","Интерфейс связи","Protocollo di comunicazione","通讯协议","Komunikacja","Protocol de communication","통신프로토콜"]
["Indication","Indicación","Anzeige","Indicação","Индикация","Indicatore","指示","Jednostka","Indication","지시"]
["Meter","Medidor","Aufnehmer ","Medidor","Расходомер","Misuratore","表","Czujnik","Débitmètre","검출기"]
["Display","Indicador","Anzeige","Indicador","Дисплей","Display","显示","Wyświetlacz","Afficheur","화면표시"]
["Local","Local","Kompaktausführung","Local","Локальный","Versione compatta","本地","Lokalny","Local","일체형"]
["Remote (Meter)","Remota (Medidor)","Fernanzeige (Wandmontage)","Remota (Medidor)","Выносное исполнение (расходомер)","Dispositivo di controllo a distanza  (misuratore)","远传（表头）","Rozłączny czujnik","Déporté (afficheur)","분리형(Meter)"]
["Remote (Panel)","Remota (Panel)","Fernanzeige (Schaltafelmontage)","Remota (Panel)","Выносное исполнение (панель)","Dispositivo di controllo a distanza  (pannello)","远传（表盘）","Rozłączny (panel)","Déporté (Panneau)","분리형(판넬형)"]
["Distance Meter-Display","Distancia Medidor-Display","Abstand Aufnehmer Anzeige","Distância Medidor-Display","Расстояние расходомер<->дисплей","Distanza (Misuratore-Display)","距离表头-显示","Długość kabla licznik-wyświetlacz","Distance débitmètre - afficheur","검출기 와 표시기 거리"]
["Technology","Tecnología","Technologie","Tecnologia","технологий","Tecnologia","技術","Technologia","Technologie","기술"]
["Safe Area","Area Segura","Sicherer Bereich","Área Segura","Безопасная зона","Area di sicurezza","安全区域","Strefa bezpieczeństwa","Zone de sécurité","안전지대"]
["Area Classification","Clasificación de Area","Zoneneinteilung","Classificação da Área","Классификация зоны","Classificazione dell'aerea","区域分级","Klasyfikacja strefy","Classification de la zone","지역등급(방폭, 안전지대)"]
["Chemical","Química","Chemisch","Química","Химическая","Chimico","化学","Chemiczny","Chimie","화학"]
["Oil & Gas","Petróleo & Gas","Öl und Gas","Óleo & Gas","Нефтехимическая","Olio & gas","石油&天然气","Olej & Gas","Oil & Gas","석유화학 & 가스"]
["Food & Beverage","Alimentos & Bebidas","Lebensmittel und Getränke","Alimentos e Bebidas","Пищевая","Alimentare","食品&饮料","Spożywczy","Alimentation et boissons","식음료"]
["Pharma&Life Science","Farmacéutica","Pharma","Farmacéutica","Фармакологическая","Farmaceutico & Life Science","制药&生命科学","Farmacja&Laboratorium","Pharma & science de la vie","의약 & 생활과학"]
["Paper","Papel & Celulosa","Papier","Papel e Celulose","Целлюлозно-бумажная","Carta","造纸","Papierniczy","Papeterie","제지"]
["Steel/Mining","Acero / Minería","Stahl/Bergbau","Aço / Mineração","Металлургическая","Acciaio/Minerario","钢铁/煤矿","Hutnictwo/Górnictwo","Aciérie/Mine","제철/광업"]
["Power","Energía","Energie","Energía","Энергетическая","Energia","电力","Energetyka","Electricité","전력"]
["Water","Agua","Wasser","Agua","Водоснабжение","Acqua","水处理","Woda","Eau","수처리"]
["Automotive","Automotriz","Automobil","Automotriz","Автомобильная","Automobilistico","汽车","Samochodowy","Automobile","자동차"]
["OEM","Fabricante de equipos","OEM","Fabricante de equipes","ОЕМ","Produzione di apparecchiature originali","OEM","OEM","Equipementiers","주문자 상표부착 생산방식(OEM)"]
["Skid Supplier","Fabricante de skids","Skid Hersteller","Fabricante de skids","Производители скидов","Produzione di skid","撬块供应商","Pośrednik","Fournisseur","SKID"]
["Marine","Marina","Marine","Marina","Морская","Navale","航海","Wojskowy","Marine","해양"]
["EPC","EPC","EPC","EPC","Инжиниринговая","EPC","总包商","EPC","EPC","EPC"]
["Other (specify)","Otra (especificar)","Andere (bitte spezifizieren)","Outra (especificar)","Другие","Altro (specificare)","其他（详细）","Inne","Autre (spécifiez)","기타 "]
["Renewable Energy","Energías Renovables","Erneuerbare Energien","Energia renovável","Возобновляемые источники энергии","Energie rinnovabili\n","可再生能源","Energia odnawialna","Energie renouvelable","신재생에너지"]
["Energy","Energía","Energie","Energia","Энергия","Energia","能源","Energia","Energie","에너지"]
["Plastic","Plásticos","Kunststoff","Plásticos","Пластик","Plastica","塑料","Plastik","Plastique","플라스틱"]
["Semiconductor","Semiconductores","Halbleiter","Semicondutores","Полупроводники","Semiconduttori","半导体","Półprzewodnik","Semi-conducteur","반도체"]
["Fuel consumption (not Marine)","Consumo de combustibles (no marinos)","Verbrauchsmessung (ohne Marine)","Consumo de combustiveis (não marino)","Расход топлива (не морской)","Misura dei consumi energetici (escluso il settore navale)","燃油消耗（非船舶)","Zużycie paliwa (nie okrętowe)","Consommation de gasoil (non marine)","연료소모"]
["Flowmeter","Medidor","Durchflussmesser","Medidor","Расходомер","Misuratore di portata ","流量计","Przepływomierz","Débitmètre","유량계"]
["Process","Proceso","Prozess","Processo","Процесс","Processo","过程 ","Proces","Process","공정"]
["Comments","Comentarios","zusätzliche Kommentare","Comentários","Комментарии","Commenti","建议","Komentarze","Commentaires","기타의견"]
["Print","Imprimir","Drucken","Imprimir","Печать","Stampare","打印","Wydrukuj","Imprimer","인쇄"]
["Reset","Borrar","zurück setzen","Apagar","Сброс","Cancellare","重置","Kasuj","Remise à zéro","리셑"]
["Save","Guardar","Speichern","Salvar","Сохранить","Conservare","保存","Zapisz","Sauvegarde","저장"]
["Gear Flow Meter","Gear medidor de flujo","Zahnradzähler","Engrenagem Flow Meter","Передач расходомер","Misuratore di portata Gear","齒輪流量計","Przepływomierz biegów","Équipement Débitmètre","기어 유량계"]
["Helical Flow Meter","Helicoidal medidor de flujo","Spindelradzähler","Helicoidal Flow Meter","Винтовая расходомер","Misuratore di portata elicoidale","螺旋流量計","Helical Flow Meter","Hélicoïdale Débitmètre","나선형 유량계"]
["Turbine Flow Meter","Turbina medidor de flujo","Turbine","Turbina Medidor de Vazão","Турбинный счетчик","Misuratore di portata a turbina","渦輪流量計","Przepływomierz turbinowy","Débitmètre à turbine","터빈 유량계"]
["Micro Flow Meter","Micro Flow Meter","Mikro Durchflussmesser","Micro Flow Meter","Микро расходомер","Misuratore di portata Micro","微流量計","Micro Flow Meter","Micro Flow Meter","마이크로 유량계"]

{"sheet":"Revisions","index":3,"n_rows":28,"n_cols":4,"rows_kept":28,"cut":false,"hidden":true,"merged":[]}
["History of Revisions"]
[]
["Date","Version","By","Comments"]
["2014-09-10","1.0","PB","First version (some translations pending)"]
["2014-09-12","1.1","PB","Chinese column included"]
[null,null,null,"Changed the colour of cells with dropdown lists"]
[null,null,null,"Included names in the dropdown lists"]
["2014-09-12","1.2","RW","Provided italian version"]
[null,null,"PB","Minor cells format"]
["2014-09-12","1.3","RW","Provided german version"]
[null,null,"PB","Extended some cells to fix longer texts"]
["2014-09-12","1.4","PB","Added Save (File Name is by default Company_TAG xxxxx) and Print buttons"]
[null,null,null,"Added link to www.tricorflow.com at the logo"]
["2014-09-15","1.5","RW","Ru and CN integrated"]
["2014-09-27","1.6","PB","Added Export to PDF button (File Name is Company_TAG xxxxx.pdf) "]
[null,null,null,"Added Reset button to clear all user inputs (some translations pending)"]
[null,null,null,"By default the Date is Today"]
["2014-09-29","1.7","PB","Minor cells format in order to fit the contents of the complete text"]
["2014-09-29","1.7","RW","Included validation of the min/max values (text is red if some value is wrong)"]
["2014-09-29","1.7","RW","Included validation of design values (text is red if some value is wrong)"]
["2014-09-30","1.8","PB","Added Max Temperature validation  (T>150*C gives a Warning)"]
[null,null,null,"Added Pressure Drop validation (can't be higher than the minimum)"]
[null,null,null,"Now Pressure Drop Unit is connected to Pressure unit (can't be different)"]
["2015-08-03","2.0","MM","Modification for PDM"]
["2015-08-03","2.1","MM","Branch list updated"]
["2015-08-03","2.2","MM","Deleted EPC; OEM;"]
[null,null,null,"Connections sorted"]
[null,null,null,"Technology full name"]